Target
Plasmepsin II
Ligand
BDBM50209559
Substrate
Meas. Tech.
ChEMBL_644190 (CHEMBL1212089)
Ki
0.5±n/a nM
Citation
 Miura, THidaka, KUemura, TKashimoto, KHori, YKawasaki, YRuben, AJFreire, EKimura, TKiso, Y Improvement of both plasmepsin inhibitory activity and antimalarial activity by 2-aminoethylamino substitution. Bioorg Med Chem Lett 20:4836-9 (2010)  
Target
Name:
Plasmepsin II
Synonyms:
Aspartic hemoglobinase II PLM2_PLAFX Plasmepsin 2 Plasmepsin-II
Type:
Enzyme
Mol. Mass.:
51482.09
Organism:
Plasmodium falciparum
Description:
P46925
Residue:
453
  
Inhibitor
Name:
BDBM50209559
Synonyms:
(4R)-3-[(2S,3S)-3-{[(2,6-dimethylphenoxy)acetyl]amino}-2-hydroxy-4-phenylbutanoyl]-N-[(1S,2R)-2-hydroxy-2,3-dihydro-1H-inden-1-yl]-5,5-dimethyl-1,3-thiazolidine-4-carboxamide CHEMBL231522 | KNI-10006
Type:
Small organic molecule
Emp. Form.:
C35H41N3O6S
Mol. Mass.:
631.782
SMILES:
Cc1cccc(C)c1OCC(=O)N[C@@H](Cc1ccccc1)[C@H](O)C(=O)N1CSC(C)(C)[C@H]1C(=O)N[C@@H]1[C@H](O)Cc2ccccc12
: