Target
Heat shock protein HSP 90-alpha
Ligand
BDBM50323783
Substrate
Meas. Tech.
ChEMBL_647264 (CHEMBL1217470)
IC50
3400±n/a nM
Citation
 Sekiguchi, HMuranaka, KOsada, AIchikawa, SMatsuda, A Efficient synthesis of Hsp90 inhibitor dimers as potential antitumor agents. Bioorg Med Chem 18:5732-7 (2010)  
Target
Name:
Heat shock protein HSP 90-alpha
Synonyms:
HS90A_HUMAN HSP86 HSP90AA1 HSPCA Heat shock 86 kDa Heat shock protein HSP 90-alpha (HSP90) LAP-2 Lipopolysaccharide-associated protein 2 heat shock protein 90kDa alpha (cytosolic), class A member 1 isoform 2
Type:
Molecular Chaperone
Mol. Mass.:
84623.45
Organism:
Homo sapiens (Human)
Description:
P07900
Residue:
732
  
Inhibitor
Name:
BDBM50323783
Synonyms:
9,9'-(4,4'-(1,1'-(3,6,9,12,15,18-hexaoxaicosane-1,20-diyl)bis(1H-1,2,3-triazole-4,1-diyl))bis(butane-4,1-diyl))bis(8-(6-bromobenzo[d][1,3]dioxol-5-ylthio)-9H-purin-6-amine) | CHEMBL1213895
Type:
Small organic molecule
Emp. Form.:
C50H60Br2N16O10S2
Mol. Mass.:
1269.051
SMILES:
Nc1ncnc2n(CCCCc3cn(CCOCCOCCOCCOCCOCCOCCn4cc(CCCCn5c(Sc6cc7OCOc7cc6Br)nc6c(N)ncnc56)nn4)nn3)c(Sc3cc4OCOc4cc3Br)nc12
: