Target
Heat shock protein HSP 90-alpha
Ligand
BDBM50323786
Substrate
Meas. Tech.
ChEMBL_647264 (CHEMBL1217470)
IC50
490±n/a nM
Citation
 Sekiguchi, HMuranaka, KOsada, AIchikawa, SMatsuda, A Efficient synthesis of Hsp90 inhibitor dimers as potential antitumor agents. Bioorg Med Chem 18:5732-7 (2010)  
Target
Name:
Heat shock protein HSP 90-alpha
Synonyms:
HS90A_HUMAN HSP86 HSP90AA1 HSPCA Heat shock 86 kDa Heat shock protein HSP 90-alpha (HSP90) LAP-2 Lipopolysaccharide-associated protein 2 heat shock protein 90kDa alpha (cytosolic), class A member 1 isoform 2
Type:
Molecular Chaperone
Mol. Mass.:
84623.45
Organism:
Homo sapiens (Human)
Description:
P07900
Residue:
732
  
Inhibitor
Name:
BDBM50323786
Synonyms:
8-(6-Bromo-3,4-methylenedioxyphenylthio)-9-[{1-(3-hydroxypropyl)-1H-1,2,3-triazol-4-yl}propyl]adenine | CHEMBL1213898
Type:
Small organic molecule
Emp. Form.:
C20H21BrN8O3S
Mol. Mass.:
533.402
SMILES:
Nc1ncnc2n(CCCc3cn(CCCO)nn3)c(Sc3cc4OCOc4cc3Br)nc12
: