Target
Acetylcholinesterase
Ligand
BDBM50324067
Substrate
Meas. Tech.
ChEMBL_649485 (CHEMBL1219183)
IC50
800±n/a nM
Citation
 Samadi, AMarco-Contelles, JSoriano, EAlvarez-Pérez, MChioua, MRomero, AGonzález-Lafuente, LGandía, LRoda, JMLópez, MGVillarroya, MGarcía, AGRíos, Cde L Multipotent drugs with cholinergic and neuroprotective properties for the treatment of Alzheimer and neuronal vascular diseases. I. Synthesis, biological assessment, and molecular modeling of simple and readily available 2-aminopyridine-, and 2-chloropyridine-3,5-dicarbonitriles. Bioorg Med Chem 18:5861-72 (2010)  
Target
Name:
Acetylcholinesterase
Synonyms:
ACES_ELEEL Acetylcholinesterase (EeAChE) | ache
Type:
Enzyme
Mol. Mass.:
71812.79
Organism:
Electrophorus electricus (Electric eel)
Description:
Residue:
633
  
Inhibitor
Name:
BDBM50324067
Synonyms:
2-Chloro-6-(pyrrolidin-1'-yl)pyridine-3,5-dicarbonitrile | CHEMBL1215102
Type:
Small organic molecule
Emp. Form.:
C11H9ClN4
Mol. Mass.:
232.669
SMILES:
Clc1nc(N2CCCC2)c(cc1C#N)C#N
: