Target
Acetylcholinesterase
Ligand
BDBM50324069
Substrate
Meas. Tech.
ChEMBL_649485 (CHEMBL1219183)
IC50
75000±n/a nM
Citation
 Samadi, AMarco-Contelles, JSoriano, EAlvarez-Pérez, MChioua, MRomero, AGonzález-Lafuente, LGandía, LRoda, JMLópez, MGVillarroya, MGarcía, AGRíos, Cde L Multipotent drugs with cholinergic and neuroprotective properties for the treatment of Alzheimer and neuronal vascular diseases. I. Synthesis, biological assessment, and molecular modeling of simple and readily available 2-aminopyridine-, and 2-chloropyridine-3,5-dicarbonitriles. Bioorg Med Chem 18:5861-72 (2010)  
Target
Name:
Acetylcholinesterase
Synonyms:
ACES_ELEEL Acetylcholinesterase (EeAChE) | ache
Type:
Enzyme
Mol. Mass.:
71812.79
Organism:
Electrophorus electricus (Electric eel)
Description:
Residue:
633
  
Inhibitor
Name:
BDBM50324069
Synonyms:
2-Chloro-6-(7'-azabicyclo[2.2.1]heptan-7'-yl)pyridine-3,5-dicarbonitrile | CHEMBL1215104
Type:
Small organic molecule
Emp. Form.:
C13H11ClN4
Mol. Mass.:
258.706
SMILES:
Clc1nc(N2C3CCC2CC3)c(cc1C#N)C#N
: