Target
Carboxylic ester hydrolase
Ligand
BDBM50324054
Substrate
Meas. Tech.
ChEMBL_649486 (CHEMBL1219184)
IC50
>100000±n/a nM
Citation
 Samadi, AMarco-Contelles, JSoriano, EAlvarez-Pérez, MChioua, MRomero, AGonzález-Lafuente, LGandía, LRoda, JMLópez, MGVillarroya, MGarcía, AGRíos, Cde L Multipotent drugs with cholinergic and neuroprotective properties for the treatment of Alzheimer and neuronal vascular diseases. I. Synthesis, biological assessment, and molecular modeling of simple and readily available 2-aminopyridine-, and 2-chloropyridine-3,5-dicarbonitriles. Bioorg Med Chem 18:5861-72 (2010)  
Target
Name:
Carboxylic ester hydrolase
Synonyms:
BuChE Butyrylcholine esterase Butyrylcholinesterase (BChE) Butyrylcholinesterase (EqBuChE) butyrylcholinesterase precursor
Type:
Protein
Mol. Mass.:
68842.83
Organism:
Equus caballus (Horse)
Description:
Q9N1N9
Residue:
602
  
Inhibitor
Name:
BDBM50324054
Synonyms:
2-Amino-6-propargylamine-pyridine-3,5-dicarbonitrile | CHEMBL1214955
Type:
Small organic molecule
Emp. Form.:
C10H7N5
Mol. Mass.:
197.1961
SMILES:
Nc1nc(NCC#C)c(cc1C#N)C#N
: