Target
Carboxylic ester hydrolase
Ligand
BDBM50324073
Substrate
Meas. Tech.
ChEMBL_649486 (CHEMBL1219184)
IC50
>100000±n/a nM
Citation
 Samadi, AMarco-Contelles, JSoriano, EAlvarez-Pérez, MChioua, MRomero, AGonzález-Lafuente, LGandía, LRoda, JMLópez, MGVillarroya, MGarcía, AGRíos, Cde L Multipotent drugs with cholinergic and neuroprotective properties for the treatment of Alzheimer and neuronal vascular diseases. I. Synthesis, biological assessment, and molecular modeling of simple and readily available 2-aminopyridine-, and 2-chloropyridine-3,5-dicarbonitriles. Bioorg Med Chem 18:5861-72 (2010)  
Target
Name:
Carboxylic ester hydrolase
Synonyms:
BuChE Butyrylcholine esterase Butyrylcholinesterase (BChE) Butyrylcholinesterase (EqBuChE) butyrylcholinesterase precursor
Type:
Protein
Mol. Mass.:
68842.83
Organism:
Equus caballus (Horse)
Description:
Q9N1N9
Residue:
602
  
Inhibitor
Name:
BDBM50324073
Synonyms:
2-Chloro-6-(7'-azabicyclo[2.2.1]heptan-7'-yl)-4-phenylpyridine-3,5-dicarbonitrile | CHEMBL1215179
Type:
Small organic molecule
Emp. Form.:
C19H15ClN4
Mol. Mass.:
334.802
SMILES:
Clc1nc(N2C3CCC2CC3)c(C#N)c(-c2ccccc2)c1C#N
: