Target
Rho-associated protein kinase 2
Ligand
BDBM50324600
Substrate
Meas. Tech.
ChEMBL_649463 (CHEMBL1219161)
IC50
156±n/a nM
Citation
 Fang, XYin, YChen, YTYao, LWang, BCameron, MDLin, LKhan, SRuiz, CSchröter, TGrant, WWeiser, APocas, JPachori, ASchürer, SLograsso, PFeng, Y Tetrahydroisoquinoline derivatives as highly selective and potent Rho kinase inhibitors. J Med Chem 53:5727-37 (2010)  
Target
Name:
Rho-associated protein kinase 2
Synonyms:
KIAA0619 ROCK2 Rho kinase 2 (ROCKII) Rho-associated protein kinase 2 (ROCK2) Rho-associated protein kinase 2/Transforming protein RhoA Rho-associated, coiled-coil-containing protein kinase II p164 ROCK-2
Type:
Protein
Mol. Mass.:
160885.43
Organism:
Homo sapiens (Human)
Description:
O75116
Residue:
1388
  
Inhibitor
Name:
BDBM50324600
Synonyms:
CHEMBL1215238 | rac-N-(2-(2-(Dimethylamino)ethoxy)-4-(1H-pyrazol-4-yl)phenyl)-6-ethoxy-1,2,3,4-tetrahydroiso-quinoline-3-carboxamide
Type:
Small organic molecule
Emp. Form.:
C25H31N5O3
Mol. Mass.:
449.5453
SMILES:
CCOc1ccc2CNC(Cc2c1)C(=O)Nc1ccc(cc1OCCN(C)C)-c1cn[nH]c1
: