Target
Rho-associated protein kinase 2
Ligand
BDBM50324588
Substrate
Meas. Tech.
ChEMBL_649463 (CHEMBL1219161)
IC50
22±n/a nM
Citation
 Fang, XYin, YChen, YTYao, LWang, BCameron, MDLin, LKhan, SRuiz, CSchröter, TGrant, WWeiser, APocas, JPachori, ASchürer, SLograsso, PFeng, Y Tetrahydroisoquinoline derivatives as highly selective and potent Rho kinase inhibitors. J Med Chem 53:5727-37 (2010)  
Target
Name:
Rho-associated protein kinase 2
Synonyms:
KIAA0619 ROCK2 Rho kinase 2 (ROCKII) Rho-associated protein kinase 2 (ROCK2) Rho-associated protein kinase 2/Transforming protein RhoA Rho-associated, coiled-coil-containing protein kinase II p164 ROCK-2
Type:
Protein
Mol. Mass.:
160885.43
Organism:
Homo sapiens (Human)
Description:
O75116
Residue:
1388
  
Inhibitor
Name:
BDBM50324588
Synonyms:
2-Amino-2-(4-chlorophenyl)-N-(2-(2-(dimethylamino)ethoxy)-4-(1H-pyrazol-4-yl)phenyl)aceta-mide | CHEMBL1215023
Type:
Small organic molecule
Emp. Form.:
C21H24ClN5O2
Mol. Mass.:
413.901
SMILES:
CN(C)CCOc1cc(ccc1NC(=O)C(N)c1ccc(Cl)cc1)-c1cn[nH]c1
: