Target
Rho-associated protein kinase 2
Ligand
BDBM50324575
Substrate
Meas. Tech.
ChEMBL_649463 (CHEMBL1219161)
IC50
51±n/a nM
Citation
 Fang, XYin, YChen, YTYao, LWang, BCameron, MDLin, LKhan, SRuiz, CSchröter, TGrant, WWeiser, APocas, JPachori, ASchürer, SLograsso, PFeng, Y Tetrahydroisoquinoline derivatives as highly selective and potent Rho kinase inhibitors. J Med Chem 53:5727-37 (2010)  
Target
Name:
Rho-associated protein kinase 2
Synonyms:
KIAA0619 ROCK2 Rho kinase 2 (ROCKII) Rho-associated protein kinase 2 (ROCK2) Rho-associated protein kinase 2/Transforming protein RhoA Rho-associated, coiled-coil-containing protein kinase II p164 ROCK-2
Type:
Protein
Mol. Mass.:
160885.43
Organism:
Homo sapiens (Human)
Description:
O75116
Residue:
1388
  
Inhibitor
Name:
BDBM50324575
Synonyms:
(R)-N-(2-(2-(Dimethylamino)ethoxy)-4-(1H-pyrazol-4-yl)-phenyl)-6-methoxy-1,2,3,4-tetrahydro-isoquinoline-3-carboxamide | CHEMBL1215171
Type:
Small organic molecule
Emp. Form.:
C24H29N5O3
Mol. Mass.:
435.5188
SMILES:
COc1ccc2CN[C@H](Cc2c1)C(=O)Nc1ccc(cc1OCCN(C)C)-c1cn[nH]c1
: