Target
Metabotropic glutamate receptor 4
Ligand
BDBM50325104
Substrate
Meas. Tech.
ChEMBL_651654 (CHEMBL1228192)
EC50
1030±n/a nM
Citation
 Engers, DWGentry, PRWilliams, RBolinger, JDWeaver, CDMenon, UNConn, PJLindsley, CWNiswender, CMHopkins, CR Synthesis and SAR of novel, 4-(phenylsulfamoyl)phenylacetamide mGlu4 positive allosteric modulators (PAMs) identified by functional high-throughput screening (HTS). Bioorg Med Chem Lett 20:5175-8 (2010)  
Target
Name:
Metabotropic glutamate receptor 4
Synonyms:
GPRC1D GRM4_HUMAN MGLUR4 Metabotropic glutamate receptor 4 (mGlu4) metabotropic glutamate 4
Type:
Protein
Mol. Mass.:
101899.95
Organism:
Homo sapiens (Human)
Description:
Q14833
Residue:
912
  
Inhibitor
Name:
BDBM50325104
Synonyms:
CHEMBL1223159 | N-(4-(N-cyclohexylsulfamoyl)phenyl)picolinamide
Type:
Small organic molecule
Emp. Form.:
C18H21N3O3S
Mol. Mass.:
359.443
SMILES:
O=C(Nc1ccc(cc1)S(=O)(=O)NC1CCCCC1)c1ccccn1
: