Target
Sodium channel protein type 9 subunit alpha
Ligand
BDBM50141073
Substrate
Meas. Tech.
ChEMBL_652883 (CHEMBL1226086)
Ki
360±n/a nM
Citation
 Tyagarajan, SChakravarty, PKZhou, BFisher, MHWyvratt, MJLyons, KKlatt, TLi, XKumar, SWilliams, BFelix, JPriest, BTBrochu, RMWarren, VSmith, MGarcia, MKaczorowski, GJMartin, WJAbbadie, CMcGowan, EJochnowitz, NParsons, WH Substituted biaryl oxazoles, imidazoles, and thiazoles as sodium channel blockers. Bioorg Med Chem Lett 20:5536-40 (2010)  
Target
Name:
Sodium channel protein type 9 subunit alpha
Synonyms:
NENA Peripheral sodium channel 1 SCN9A_HUMAN Voltage-gated sodium channel subunit Nav1.7 hNE-Na
Type:
Protein
Mol. Mass.:
226375.97
Organism:
Homo sapiens (Human)
Description:
Q15858
Residue:
1988
  
Inhibitor
Name:
BDBM50141073
Synonyms:
(E)-2-(4-(4-fluorophenoxy)benzylidene)hydrazinecarboxamide CHEMBL287833 | V-102862
Type:
Small organic molecule
Emp. Form.:
C14H12FN3O2
Mol. Mass.:
273.2624
SMILES:
NC(=O)NN=Cc1ccc(Oc2ccc(F)cc2)cc1
: