Target
Fibroblast growth factor receptor 1
Ligand
BDBM50300690
Substrate
Meas. Tech.
ChEMBL_655794 (CHEMBL1244838)
Kd
>10000±n/a nM
Citation
 Zarrinkar, PPGunawardane, RNCramer, MDGardner, MFBrigham, DBelli, BKaraman, MWPratz, KWPallares, GChao, QSprankle, KGPatel, HKLevis, MArmstrong, RCJames, JBhagwat, SS AC220 is a uniquely potent and selective inhibitor of FLT3 for the treatment of acute myeloid leukemia (AML). Blood 114:2984-92 (2009)  
Target
Name:
Fibroblast growth factor receptor 1
Synonyms:
BFGFR Basic fibroblast growth factor receptor 1 (FGFR1) CEK FGFR-1 FGFR-1, (FL) FGFR1_HUMAN FLT2 Fibroblast growth factor receptor 1 (FGFR-1) Fms-like tyrosine kinase 2 N-sam bFGF-R | c-fgr
Type:
Receptor
Mol. Mass.:
91861.70
Organism:
Homo sapiens (Human)
Description:
P11362
Residue:
822
  
Inhibitor
Name:
BDBM50300690
Synonyms:
1-(5-Tert-Butyl-1,2-Oxazol-3-Yl)-3-(4-{7-[2-(Morpholin-4-Yl)ethoxy]imidazo[2,1-B][1,3]benzothiazol-2-Yl}phenyl)urea AC 220 AC010220 ASP-2689 N-(5-tert-Butyl-isoxazol-3-yl)-N'-{4-[7-(2-morpholin-4-yl-ethoxy)imidazo[2,1-b][1,3]benzothiazol-2-yl]phenyl}urea Quizartinib (AC220) US11542261, Compound quizartinib | US9216997, Quizartinib (positive compound)
Type:
Small organic molecule
Emp. Form.:
C29H32N6O4S
Mol. Mass.:
560.667
SMILES:
CC(C)(C)c1cc(NC(=O)Nc2ccc(cc2)-c2cn3c(n2)sc2cc(OCCN4CCOCC4)ccc32)no1
: