Target
Potassium voltage-gated channel subfamily H member 2
Ligand
BDBM50413549
Substrate
Meas. Tech.
ChEMBL_657972 (CHEMBL1248651)
Ki
2511.89±n/a nM
Citation
 Bromidge, SMArban, RBertani, BBison, SBorriello, MCavanni, PDal Forno, GDi-Fabio, RDonati, DFontana, SGianotti, MGordon, LJGranci, ELeslie, CPMoccia, LPasquarello, ASartori, ISava, AWatson, JMWorby, AZonzini, LZucchelli, V Design and synthesis of novel tricyclic benzoxazines as potent 5-HT(1A/B/D) receptor antagonists leading to the discovery of 6-{2-[4-(2-methyl-5-quinolinyl)-1-piperazinyl]ethyl}-4H-imidazo[5,1-c][1,4]benzoxazine-3-carboxamide (GSK588045). J Med Chem 53:5827-43 (2010)  
Target
Name:
Potassium voltage-gated channel subfamily H member 2
Synonyms:
1,3-beta-glucan synthase component GLS2 ERG Eag-related protein 1 Ether-a-go-go-related gene (HERG) Ether-a-go-go-related gene potassium channel 1 Ether-a-go-go-related gene potassium channel 1 (hERG1) Ether-a-go-go-related protein 1 H-ERG KCNH2 Potassium voltage-gated channel subfamily H member 2 (hERG) Voltage-gated potassium channel subunit Kv11.1 hERG Potassium Channel 1 | putative potassium channel subunit
Type:
Multi-pass membrane protein
Mol. Mass.:
126672.65
Organism:
Homo sapiens (Human)
Description:
Q12809
Residue:
1159
  
Inhibitor
Name:
BDBM50413549
Synonyms:
CHEMBL513715
Type:
Small organic molecule
Emp. Form.:
C24H26N4O2
Mol. Mass.:
402.4888
SMILES:
Cc1ccc2c(cccc2n1)N1CCN(CCc2cccc3NC(=O)COc23)CC1
: