Target
Oxytocin receptor
Ligand
BDBM50326715
Substrate
Meas. Tech.
ChEMBL_661536 (CHEMBL1253100)
Ki
9.1±n/a nM
Citation
 Borthwick, AD Oral oxytocin antagonists. J Med Chem 53:6525-38 (2010)  
Target
Name:
Oxytocin receptor
Synonyms:
OT-R OXYR_HUMAN | Oxytocin
Type:
Enzyme Catalytic Domain
Mol. Mass.:
42793.26
Organism:
Homo sapiens (Human)
Description:
Oxytocin OXTR HEK293::B2R9L7
Residue:
389
  
Inhibitor
Name:
BDBM50326715
Synonyms:
CHEMBL456263 | N-(6-methoxypyridin-3-yl)-1,2-dimethyl-N-((5-o-tolylpyridin-2-yl)methyl)-1H-imidazole-4-sulfonamide
Type:
Small organic molecule
Emp. Form.:
C24H25N5O3S
Mol. Mass.:
463.552
SMILES:
COc1ccc(cn1)N(Cc1ccc(cn1)-c1ccccc1C)S(=O)(=O)c1cn(C)c(C)n1
: