Target
Oxytocin receptor
Ligand
BDBM50064711
Substrate
Meas. Tech.
ChEMBL_661536 (CHEMBL1253100)
Ki
4.9±n/a nM
Citation
 Borthwick, AD Oral oxytocin antagonists. J Med Chem 53:6525-38 (2010)  
Target
Name:
Oxytocin receptor
Synonyms:
OT-R OXYR_HUMAN | Oxytocin
Type:
Enzyme Catalytic Domain
Mol. Mass.:
42793.26
Organism:
Homo sapiens (Human)
Description:
Oxytocin OXTR HEK293::B2R9L7
Residue:
389
  
Inhibitor
Name:
BDBM50064711
Synonyms:
1-(1-{2-Methoxy-4-[1-(2-methyl-1-oxy-pyridin-3-ylmethyl)-piperidin-4-yloxy]-benzoyl}-piperidin-4-yl)-1,4-dihydro-benzo[d][1,3]oxazin-2-one | CHEMBL306645
Type:
Small organic molecule
Emp. Form.:
C33H38N4O6
Mol. Mass.:
586.678
SMILES:
COc1cc(OC2CCN(Cc3ccc[n+]([O-])c3C)CC2)ccc1C(=O)N1CCC(CC1)N1C(=O)OCc2ccccc12
: