Target
Vasopressin V1a receptor
Ligand
BDBM50326719
Substrate
Meas. Tech.
ChEMBL_661538 (CHEMBL1253102)
Ki
180±n/a nM
Citation
 Borthwick, AD Oral oxytocin antagonists. J Med Chem 53:6525-38 (2010)  
Target
Name:
Vasopressin V1a receptor
Synonyms:
AVPR V1a AVPR1A V1AR_HUMAN VASOPRESSIN V1A Vasopressin V1 receptor Vasopressin receptor
Type:
Receptor
Mol. Mass.:
46820.18
Organism:
Homo sapiens (Human)
Description:
P37288
Residue:
418
  
Inhibitor
Name:
BDBM50326719
Synonyms:
(S)-2-amino-N-((1S,2S,4R)-7,7-dimethyl-1-((4-o-tolylpiperazin-1-ylsulfonyl)methyl)bicyclo[2.2.1]heptan-2-yl)-4-(methylsulfonyl)butanamide | CHEMBL1253853
Type:
Small organic molecule
Emp. Form.:
C26H42N4O5S2
Mol. Mass.:
554.765
SMILES:
Cc1ccccc1N1CCN(CC1)S(=O)(=O)C[C@]12CC[C@H](C[C@@H]1NC(=O)[C@@H](N)CCS(C)(=O)=O)C2(C)C
: