Target
Oxytocin receptor
Ligand
BDBM50113050
Substrate
Meas. Tech.
ChEMBL_661552 (CHEMBL1253116)
Ki
2±n/a nM
Citation
 Borthwick, AD Oral oxytocin antagonists. J Med Chem 53:6525-38 (2010)  
Target
Name:
Oxytocin receptor
Synonyms:
OT-R OXYR_HUMAN | Oxytocin
Type:
Enzyme Catalytic Domain
Mol. Mass.:
42793.26
Organism:
Homo sapiens (Human)
Description:
Oxytocin OXTR HEK293::B2R9L7
Residue:
389
  
Inhibitor
Name:
BDBM50113050
Synonyms:
CHEMBL31065 | N-{5-[4-(2-Oxo-4H-benzo[d][1,3]oxazin-1-yl)-piperidine-1-carbonyl]-benzofuran-2-ylmethyl}-2-(2-oxo-5-trifluoromethyl-2H-pyridin-1-yl)-acetamide
Type:
Small organic molecule
Emp. Form.:
C31H27F3N4O6
Mol. Mass.:
608.5645
SMILES:
FC(F)(F)c1ccc(=O)n(CC(=O)NCc2cc3cc(ccc3o2)C(=O)N2CCC(CC2)N2C(=O)OCc3ccccc23)c1
: