Target
Oxytocin receptor
Ligand
BDBM50326721
Substrate
Meas. Tech.
ChEMBL_661556 (CHEMBL1253120)
Ki
210±n/a nM
Citation
 Borthwick, AD Oral oxytocin antagonists. J Med Chem 53:6525-38 (2010)  
Target
Name:
Oxytocin receptor
Synonyms:
OT-R Otr Oxytocin
Type:
Enzyme Catalytic Domain
Mol. Mass.:
42889.28
Organism:
RAT
Description:
Oxytocin OXTR RAT::P70536
Residue:
388
  
Inhibitor
Name:
BDBM50326721
Synonyms:
(S)-(2-(hydroxymethyl)-4-(methoxyimino)pyrrolidin-1-yl)(2'-methylbiphenyl-4-yl)methanone | CHEMBL1254025
Type:
Small organic molecule
Emp. Form.:
C20H22N2O3
Mol. Mass.:
338.4003
SMILES:
CO\N=C1\C[C@@H](CO)N(C1)C(=O)c1ccc(cc1)-c1ccccc1C
: