Target
Vasopressin V1a receptor
Ligand
BDBM50326721
Substrate
Meas. Tech.
ChEMBL_661553 (CHEMBL1253117)
Ki
330±n/a nM
Citation
 Borthwick, AD Oral oxytocin antagonists. J Med Chem 53:6525-38 (2010)  
Target
Name:
Vasopressin V1a receptor
Synonyms:
AVPR V1a AVPR1A V1AR_HUMAN VASOPRESSIN V1A Vasopressin V1 receptor Vasopressin receptor
Type:
Receptor
Mol. Mass.:
46820.18
Organism:
Homo sapiens (Human)
Description:
P37288
Residue:
418
  
Inhibitor
Name:
BDBM50326721
Synonyms:
(S)-(2-(hydroxymethyl)-4-(methoxyimino)pyrrolidin-1-yl)(2'-methylbiphenyl-4-yl)methanone | CHEMBL1254025
Type:
Small organic molecule
Emp. Form.:
C20H22N2O3
Mol. Mass.:
338.4003
SMILES:
CO\N=C1\C[C@@H](CO)N(C1)C(=O)c1ccc(cc1)-c1ccccc1C
: