Target
Vasopressin V1a receptor
Ligand
BDBM50326722
Substrate
Meas. Tech.
ChEMBL_661538 (CHEMBL1253102)
Ki
0.65±n/a nM
Citation
 Borthwick, AD Oral oxytocin antagonists. J Med Chem 53:6525-38 (2010)  
Target
Name:
Vasopressin V1a receptor
Synonyms:
AVPR V1a AVPR1A V1AR_HUMAN VASOPRESSIN V1A Vasopressin V1 receptor Vasopressin receptor
Type:
Receptor
Mol. Mass.:
46820.18
Organism:
Homo sapiens (Human)
Description:
P37288
Residue:
418
  
Inhibitor
Name:
BDBM50326722
Synonyms:
(Z)-3-(4-(N-(4-chlorophenyl)-N-(2-oxo-2-(2-(2-oxoindolin-3-ylidene)hydrazinyl)ethyl)sulfamoyl)phenyl)-N-(3-(dimethylamino)propyl)propanamide CHEMBL445816
Type:
Small organic molecule
Emp. Form.:
C30H33ClN6O5S
Mol. Mass.:
625.138
SMILES:
CN(C)CCCNC(=O)CCc1ccc(cc1)S(=O)(=O)N(CC(=O)N\N=C1/C(=O)Nc2ccccc12)c1ccc(Cl)cc1
: