Target
Vasopressin V1a receptor
Ligand
BDBM50262153
Substrate
Meas. Tech.
ChEMBL_661560 (CHEMBL1253124)
Ki
28±n/a nM
Citation
 Borthwick, AD Oral oxytocin antagonists. J Med Chem 53:6525-38 (2010)  
Target
Name:
Vasopressin V1a receptor
Synonyms:
AVPR V1a AVPR1A V1AR_HUMAN VASOPRESSIN V1A Vasopressin V1 receptor Vasopressin receptor
Type:
Receptor
Mol. Mass.:
46820.18
Organism:
Homo sapiens (Human)
Description:
P37288
Residue:
418
  
Inhibitor
Name:
BDBM50262153
Synonyms:
4-{2-[2-(3-Biphenyl-4-yl-5-methyl-[1,2,4]triazol-4-yl)-phenoxy]-ethyl}-morpholine | CHEMBL467154
Type:
Small organic molecule
Emp. Form.:
C27H28N4O2
Mol. Mass.:
440.5368
SMILES:
Cc1nnc(-c2ccc(cc2)-c2ccccc2)n1-c1ccccc1OCCN1CCOCC1
: