Target
Vasopressin V1a receptor
Ligand
BDBM50326723
Substrate
Meas. Tech.
ChEMBL_661560 (CHEMBL1253124)
Ki
60±n/a nM
Citation
 Borthwick, AD Oral oxytocin antagonists. J Med Chem 53:6525-38 (2010)  
Target
Name:
Vasopressin V1a receptor
Synonyms:
AVPR V1a AVPR1A V1AR_HUMAN VASOPRESSIN V1A Vasopressin V1 receptor Vasopressin receptor
Type:
Receptor
Mol. Mass.:
46820.18
Organism:
Homo sapiens (Human)
Description:
P37288
Residue:
418
  
Inhibitor
Name:
BDBM50326723
Synonyms:
(R)-(4-(methoxyimino)-2-(3-methyl-1,2,4-oxadiazol-5-yl)pyrrolidin-1-yl)(2'-methylbiphenyl-4-yl)methanone | CHEMBL1254210
Type:
Small organic molecule
Emp. Form.:
C22H22N4O3
Mol. Mass.:
390.4351
SMILES:
CO\N=C1\C[C@@H](N(C1)C(=O)c1ccc(cc1)-c1ccccc1C)c1nc(C)no1
: