Target
1,3-beta-D-glucan synthase catalytic subunit
Ligand
BDBM50327030
Substrate
Meas. Tech.
ChEMBL_663643 (CHEMBL1251396)
IC50
>84000±n/a nM
Citation
 Ma, CMAbe, TKomiyama, TWang, WHattori, MDaneshtalab, M Synthesis, anti-fungal and 1,3-ß-D-glucan synthase inhibitory activities of caffeic and quinic acid derivatives. Bioorg Med Chem 18:7009-14 (2010)  
Target
Name:
1,3-beta-D-glucan synthase catalytic subunit
Synonyms:
1,3-beta-D-glucan synthase catalytic subunit | Beta-1,3-glucan synthase
Type:
PROTEIN
Mol. Mass.:
80469.77
Organism:
Candida albicans
Description:
ChEMBL_663643
Residue:
690
  
Inhibitor
Name:
BDBM50327030
Synonyms:
3-(3,4-dihydroxyphenyl)-N-(4-(octyloxy)phenyl)acrylamide | CHEMBL1254749
Type:
Small organic molecule
Emp. Form.:
C23H29NO4
Mol. Mass.:
383.4807
SMILES:
CCCCCCCCOc1ccc(NC(=O)\C=C\c2ccc(O)c(O)c2)cc1
: