Target
Focal adhesion kinase 1
Ligand
BDBM50327046
Substrate
Meas. Tech.
ChEMBL_663755 (CHEMBL1250655)
IC50
2600±n/a nM
Citation
 Oguro, YMiyamoto, NOkada, KTakagi, TIwata, HAwazu, YMiki, HHori, AKamiyama, KImamura, S Design, synthesis, and evaluation of 5-methyl-4-phenoxy-5H-pyrrolo[3,2-d]pyrimidine derivatives: novel VEGFR2 kinase inhibitors binding to inactive kinase conformation. Bioorg Med Chem 18:7260-73 (2010)  
Target
Name:
Focal adhesion kinase 1
Synonyms:
FADK 1 FAK1 FLT4 Focal adhesion kinase (FAK) Focal adhesion kinase 1 (FAK) Focal adhesion kinase-related nonkinase PTK2 Protein-tyrosine kinase 2 p125FAK | pp125FAK
Type:
Tyrosine-protein kinase
Mol. Mass.:
119233.17
Organism:
Homo sapiens (Human)
Description:
Q05397
Residue:
1052
  
Inhibitor
Name:
BDBM50327046
Synonyms:
1-(2-fluoro-4-(5-methyl-5H-pyrrolo[3,2-d]pyrimidin-4-yloxy)phenyl)-3-(3-(trifluoromethyl)phenyl)urea CHEMBL1254007 | D3RKN_16
Type:
Small organic molecule
Emp. Form.:
C21H15F4N5O2
Mol. Mass.:
445.3697
SMILES:
Cn1ccc2ncnc(Oc3ccc(NC(=O)Nc4cccc(c4)C(F)(F)F)c(F)c3)c12
: