Target
Serine/threonine-protein kinase B-raf
Ligand
BDBM50327046
Substrate
Meas. Tech.
ChEMBL_663756 (CHEMBL1250656)
IC50
900±n/a nM
Citation
 Oguro, YMiyamoto, NOkada, KTakagi, TIwata, HAwazu, YMiki, HHori, AKamiyama, KImamura, S Design, synthesis, and evaluation of 5-methyl-4-phenoxy-5H-pyrrolo[3,2-d]pyrimidine derivatives: novel VEGFR2 kinase inhibitors binding to inactive kinase conformation. Bioorg Med Chem 18:7260-73 (2010)  
Target
Name:
Serine/threonine-protein kinase B-raf
Synonyms:
B-RAF B-Raf proto-oncogene serine/threonine-protein kinase BRAF1 RAFB1 v-Raf murine sarcoma viral oncogene homolog B1
Type:
Serine/threonine-protein kinase
Mol. Mass.:
84446.00
Organism:
Homo sapiens (Human)
Description:
P15056
Residue:
766
  
Inhibitor
Name:
BDBM50327046
Synonyms:
1-(2-fluoro-4-(5-methyl-5H-pyrrolo[3,2-d]pyrimidin-4-yloxy)phenyl)-3-(3-(trifluoromethyl)phenyl)urea CHEMBL1254007 | D3RKN_16
Type:
Small organic molecule
Emp. Form.:
C21H15F4N5O2
Mol. Mass.:
445.3697
SMILES:
Cn1ccc2ncnc(Oc3ccc(NC(=O)Nc4cccc(c4)C(F)(F)F)c(F)c3)c12
: