Target
Glycogen synthase kinase-3 beta
Ligand
BDBM50327046
Substrate
Meas. Tech.
ChEMBL_663759 (CHEMBL1250659)
IC50
>10000±n/a nM
Citation
 Oguro, YMiyamoto, NOkada, KTakagi, TIwata, HAwazu, YMiki, HHori, AKamiyama, KImamura, S Design, synthesis, and evaluation of 5-methyl-4-phenoxy-5H-pyrrolo[3,2-d]pyrimidine derivatives: novel VEGFR2 kinase inhibitors binding to inactive kinase conformation. Bioorg Med Chem 18:7260-73 (2010)  
Target
Name:
Glycogen synthase kinase-3 beta
Synonyms:
GSK-3 beta GSK3B Glycogen synthase kinase 3 beta (GSK3B) Glycogen synthase kinase-3 beta (GSK-3B) Glycogen synthase kinase-3 beta (GSK3B) Glycogen synthase kinase-3beta (GSK3B) | Serine/threonine-protein kinase GSK3B
Type:
Enzyme
Mol. Mass.:
46756.38
Organism:
Homo sapiens (Human)
Description:
P49841
Residue:
420
  
Inhibitor
Name:
BDBM50327046
Synonyms:
1-(2-fluoro-4-(5-methyl-5H-pyrrolo[3,2-d]pyrimidin-4-yloxy)phenyl)-3-(3-(trifluoromethyl)phenyl)urea CHEMBL1254007 | D3RKN_16
Type:
Small organic molecule
Emp. Form.:
C21H15F4N5O2
Mol. Mass.:
445.3697
SMILES:
Cn1ccc2ncnc(Oc3ccc(NC(=O)Nc4cccc(c4)C(F)(F)F)c(F)c3)c12
: