Target
D(2) dopamine receptor
Ligand
BDBM50327606
Substrate
Meas. Tech.
ChEMBL_664672 (CHEMBL1260558)
Ki
0.0575±n/a nM
Citation
 Favor, DAPowers, JJWhite, ADFitzgerald, LWGroppi, VSerpa, KA 6-Alkoxyisoindolin-1-one based dopamine D2 partial agonists as potential antipsychotics. Bioorg Med Chem Lett 20:5666-9 (2010)  
Target
Name:
D(2) dopamine receptor
Synonyms:
D(2) dopamine receptor DOPAMINE D2 Long DRD2 Dopamine D2 receptor Dopamine D2 receptor (D2R) Dopamine2-like | d2
Type:
Cell-surface receptors
Mol. Mass.:
50647.10
Organism:
Homo sapiens (Human)
Description:
P14416
Residue:
443
  
Inhibitor
Name:
BDBM50327606
Synonyms:
6-(4-(4-(2,3-dihydro-1H-inden-4-yl)piperazin-1-yl)butoxy)isoindolin-1-one | CHEMBL1257382
Type:
Small organic molecule
Emp. Form.:
C25H31N3O2
Mol. Mass.:
405.5325
SMILES:
O=C1NCc2ccc(OCCCCN3CCN(CC3)c3cccc4CCCc34)cc12
: