Target
Aldo-keto reductase family 1 member B1
Ligand
BDBM50055710
Substrate
Meas. Tech.
ChEMBL_664730 (CHEMBL1260797)
IC50
>400000±n/a nM
Citation
 Kato, AKobayashi, KNarukawa, KMinoshima, YAdachi, IHirono, SNash, RJ 6,7-Dihydroxy-4-phenylcoumarin as inhibitor of aldose reductase 2. Bioorg Med Chem Lett 20:5630-3 (2010)  
Target
Name:
Aldo-keto reductase family 1 member B1
Synonyms:
AKR1B1 ALDR_HUMAN AR Aldose Reductase (ALR2) Aldose reductase (AR)
Type:
Protein
Mol. Mass.:
35855.50
Organism:
Homo sapiens (Human)
Description:
P15121. 4LAU; 2IKI; 4LB4; 2FZD; 2FZ8; 1US0
Residue:
316
  
Inhibitor
Name:
BDBM50055710
Synonyms:
4-HYDROXY-2H-CHROMEN-2-ONE 4-hydroxycoumarin | CHEMBL301141
Type:
Small organic molecule
Emp. Form.:
C9H6O3
Mol. Mass.:
162.1421
SMILES:
Oc1cc(=O)oc2ccccc12
: