Target
Sorbitol dehydrogenase
Ligand
BDBM50055710
Substrate
Meas. Tech.
ChEMBL_664732 (CHEMBL1260799)
IC50
>400000±n/a nM
Citation
 Kato, AKobayashi, KNarukawa, KMinoshima, YAdachi, IHirono, SNash, RJ 6,7-Dihydroxy-4-phenylcoumarin as inhibitor of aldose reductase 2. Bioorg Med Chem Lett 20:5630-3 (2010)  
Target
Name:
Sorbitol dehydrogenase
Synonyms:
DHSO_HUMAN SORD
Type:
PROTEIN
Mol. Mass.:
38332.20
Organism:
Homo sapiens (Human)
Description:
ChEMBL_223910
Residue:
357
  
Inhibitor
Name:
BDBM50055710
Synonyms:
4-HYDROXY-2H-CHROMEN-2-ONE 4-hydroxycoumarin | CHEMBL301141
Type:
Small organic molecule
Emp. Form.:
C9H6O3
Mol. Mass.:
162.1421
SMILES:
Oc1cc(=O)oc2ccccc12
: