Target
Transient receptor potential cation channel subfamily A member 1
Ligand
BDBM50327681
Substrate
Meas. Tech.
ChEMBL_664761 (CHEMBL1259371)
EC50
40±n/a nM
Citation
 Gijsen, HJBerthelot, DZaja, MBrône, BGeuens, IMercken, M Analogues of morphanthridine and the tear gas dibenz[b,f][1,4]oxazepine (CR) as extremely potent activators of the human transient receptor potential ankyrin 1 (TRPA1) channel. J Med Chem 53:7011-20 (2010)  
Target
Name:
Transient receptor potential cation channel subfamily A member 1
Synonyms:
ANKTM1 TRPA1 Transformation-sensitive protein p120 | Transient receptor potential cation channel subfamily A member 1 (TRPA1)
Type:
Protein
Mol. Mass.:
127514.20
Organism:
Homo sapiens (Human)
Description:
O75762
Residue:
1119
  
Inhibitor
Name:
BDBM50327681
Synonyms:
11H-Dibenzo[b,e]azepine-10-carboxylic acid diethylamide | CHEMBL1258325
Type:
Small organic molecule
Emp. Form.:
C19H20N2O
Mol. Mass.:
292.3749
SMILES:
CCN(CC)C(=O)c1cccc2C=Nc3ccccc3Cc12
: