Target
Transient receptor potential cation channel subfamily A member 1
Ligand
BDBM50327670
Substrate
Meas. Tech.
ChEMBL_664761 (CHEMBL1259371)
EC50
158±n/a nM
Citation
 Gijsen, HJBerthelot, DZaja, MBrône, BGeuens, IMercken, M Analogues of morphanthridine and the tear gas dibenz[b,f][1,4]oxazepine (CR) as extremely potent activators of the human transient receptor potential ankyrin 1 (TRPA1) channel. J Med Chem 53:7011-20 (2010)  
Target
Name:
Transient receptor potential cation channel subfamily A member 1
Synonyms:
ANKTM1 TRPA1 Transformation-sensitive protein p120 | Transient receptor potential cation channel subfamily A member 1 (TRPA1)
Type:
Protein
Mol. Mass.:
127514.20
Organism:
Homo sapiens (Human)
Description:
O75762
Residue:
1119
  
Inhibitor
Name:
BDBM50327670
Synonyms:
11H-dibenzo[b,e]azepine-8-carbonitrile | CHEMBL1256162
Type:
Small organic molecule
Emp. Form.:
C15H10N2
Mol. Mass.:
218.2533
SMILES:
N#Cc1ccc2Cc3ccccc3N=Cc2c1
: