Target
Transient receptor potential cation channel subfamily A member 1
Ligand
BDBM50203072
Substrate
Meas. Tech.
ChEMBL_664765 (CHEMBL1259375)
EC50
12023±n/a nM
Citation
 Gijsen, HJBerthelot, DZaja, MBrône, BGeuens, IMercken, M Analogues of morphanthridine and the tear gas dibenz[b,f][1,4]oxazepine (CR) as extremely potent activators of the human transient receptor potential ankyrin 1 (TRPA1) channel. J Med Chem 53:7011-20 (2010)  
Target
Name:
Transient receptor potential cation channel subfamily A member 1
Synonyms:
ANKTM1 TRPA1 Transformation-sensitive protein p120 | Transient receptor potential cation channel subfamily A member 1 (TRPA1)
Type:
Protein
Mol. Mass.:
127514.20
Organism:
Homo sapiens (Human)
Description:
O75762
Residue:
1119
  
Inhibitor
Name:
BDBM50203072
Synonyms:
3-isothiocyanatoprop-1-ene Allylisothiocyanate | CHEMBL233248
Type:
Small organic molecule
Emp. Form.:
C4H5NS
Mol. Mass.:
99.154
SMILES:
C=CCN=C=S
: