Target
Transient receptor potential cation channel subfamily A member 1
Ligand
BDBM50327657
Substrate
Meas. Tech.
ChEMBL_664761 (CHEMBL1259371)
EC50
0.900000±n/a nM
Citation
 Gijsen, HJBerthelot, DZaja, MBrône, BGeuens, IMercken, M Analogues of morphanthridine and the tear gas dibenz[b,f][1,4]oxazepine (CR) as extremely potent activators of the human transient receptor potential ankyrin 1 (TRPA1) channel. J Med Chem 53:7011-20 (2010)  
Target
Name:
Transient receptor potential cation channel subfamily A member 1
Synonyms:
ANKTM1 TRPA1 Transformation-sensitive protein p120 | Transient receptor potential cation channel subfamily A member 1 (TRPA1)
Type:
Protein
Mol. Mass.:
127514.20
Organism:
Homo sapiens (Human)
Description:
O75762
Residue:
1119
  
Inhibitor
Name:
BDBM50327657
Synonyms:
2-chlorobenzylidenemalononitrile | CHEMBL1256101
Type:
Small organic molecule
Emp. Form.:
C10H5ClN2
Mol. Mass.:
188.613
SMILES:
Clc1ccccc1\[#6]=[#6](\C#N)C#N
: