Target
Malonyl-CoA decarboxylase, mitochondrial
Ligand
BDBM50328213
Substrate
Meas. Tech.
ChEMBL_665404 (CHEMBL1261133)
IC50
11±n/a nM
Citation
 Tang, HYan, YFeng, Zde Jesus, RKYang, LLevorse, DAOwens, KAAkiyama, TEBergeron, RCastriota, GADoebber, TWEllsworth, KPLassman, MELi, CWu, MSZhang, BBChapman, KTMills, SGBerger, JPPasternak, A Design and synthesis of a new class of malonyl-CoA decarboxylase inhibitors with anti-obesity and anti-diabetic activities. Bioorg Med Chem Lett 20:6088-92 (2010)  
Target
Name:
Malonyl-CoA decarboxylase, mitochondrial
Synonyms:
DCMC_HUMAN Malonyl-CoA decarboxylase
Type:
PROTEIN
Mol. Mass.:
55018.37
Organism:
Homo sapiens (Human)
Description:
ChEMBL_665404
Residue:
493
  
Inhibitor
Name:
BDBM50328213
Synonyms:
2-(2-(4-(3,4-difluorophenyl)piperazin-1-yl)thiazol-5-yl)-1,1,1,3,3,3-hexafluoropropan-2-ol | CHEMBL1258138
Type:
Small organic molecule
Emp. Form.:
C16H13F8N3OS
Mol. Mass.:
447.346
SMILES:
OC(c1cnc(s1)N1CCN(CC1)c1ccc(F)c(F)c1)(C(F)(F)F)C(F)(F)F
: