Target
Malonyl-CoA decarboxylase, mitochondrial
Ligand
BDBM50328217
Substrate
Meas. Tech.
ChEMBL_665404 (CHEMBL1261133)
IC50
8.9±n/a nM
Citation
 Tang, HYan, YFeng, Zde Jesus, RKYang, LLevorse, DAOwens, KAAkiyama, TEBergeron, RCastriota, GADoebber, TWEllsworth, KPLassman, MELi, CWu, MSZhang, BBChapman, KTMills, SGBerger, JPPasternak, A Design and synthesis of a new class of malonyl-CoA decarboxylase inhibitors with anti-obesity and anti-diabetic activities. Bioorg Med Chem Lett 20:6088-92 (2010)  
Target
Name:
Malonyl-CoA decarboxylase, mitochondrial
Synonyms:
DCMC_HUMAN Malonyl-CoA decarboxylase
Type:
PROTEIN
Mol. Mass.:
55018.37
Organism:
Homo sapiens (Human)
Description:
ChEMBL_665404
Residue:
493
  
Inhibitor
Name:
BDBM50328217
Synonyms:
1,1,1,3,3,3-hexafluoro-2-(2-(4-(4-nitrophenyl)piperazin-1-yl)thiazol-5-yl)propan-2-ol | CHEMBL1258366
Type:
Small organic molecule
Emp. Form.:
C16H14F6N4O3S
Mol. Mass.:
456.363
SMILES:
OC(c1cnc(s1)N1CCN(CC1)c1ccc(cc1)[N+]([O-])=O)(C(F)(F)F)C(F)(F)F
: