Target
Malonyl-CoA decarboxylase, mitochondrial
Ligand
BDBM50328239
Substrate
Meas. Tech.
ChEMBL_665404 (CHEMBL1261133)
IC50
4.5±n/a nM
Citation
 Tang, HYan, YFeng, Zde Jesus, RKYang, LLevorse, DAOwens, KAAkiyama, TEBergeron, RCastriota, GADoebber, TWEllsworth, KPLassman, MELi, CWu, MSZhang, BBChapman, KTMills, SGBerger, JPPasternak, A Design and synthesis of a new class of malonyl-CoA decarboxylase inhibitors with anti-obesity and anti-diabetic activities. Bioorg Med Chem Lett 20:6088-92 (2010)  
Target
Name:
Malonyl-CoA decarboxylase, mitochondrial
Synonyms:
DCMC_HUMAN Malonyl-CoA decarboxylase
Type:
PROTEIN
Mol. Mass.:
55018.37
Organism:
Homo sapiens (Human)
Description:
ChEMBL_665404
Residue:
493
  
Inhibitor
Name:
BDBM50328239
Synonyms:
1-(5-(1,1,1,3,3,3-hexafluoro-2-hydroxypropan-2-yl)thiazol-2-yl)-4-phenylpiperidin-4-ol | CHEMBL1257792
Type:
Small organic molecule
Emp. Form.:
C17H16F6N2O2S
Mol. Mass.:
426.377
SMILES:
OC(c1cnc(s1)N1CCC(O)(CC1)c1ccccc1)(C(F)(F)F)C(F)(F)F
: