Target
Beta-3 adrenergic receptor
Ligand
BDBM50328307
Substrate
Meas. Tech.
ChEMBL_665490 (CHEMBL1261321)
IC50
107±n/a nM
Citation
 Tasler, SBaumgartner, RAmmendola, ASchachtner, JWieber, TBlisse, MRath, SZaja, MKlahn, PQuotschalla, UNey, P Thienopyrimidines asß3-adrenoceptor agonists: hit-to-lead optimization. Bioorg Med Chem Lett 20:6108-15 (2010)  
Target
Name:
Beta-3 adrenergic receptor
Synonyms:
ADRB3 ADRB3_HUMAN Beta-2 adrenergic receptor and beta-3 adrenergic receptor Beta-3 adrenoreceptor | adrenergic Beta3
Type:
G Protein-Coupled Receptor (GPCR)
Mol. Mass.:
43534.88
Organism:
Homo sapiens (Human)
Description:
Residue:
408
  
Inhibitor
Name:
BDBM50328307
Synonyms:
CHEMBL1258825 | N-(3-(2-hydroxy-3-(1-(5-phenylthieno[2,3-d]pyrimidin-4-yl)piperidin-4-ylamino)propoxy)phenyl)acetamide
Type:
Small organic molecule
Emp. Form.:
C28H31N5O3S
Mol. Mass.:
517.642
SMILES:
CC(=O)Nc1cccc(OCC(O)CNC2CCN(CC2)c2ncnc3scc(-c4ccccc4)c23)c1
: