Target
5-hydroxytryptamine receptor 2A
Ligand
BDBM50328457
Substrate
Meas. Tech.
ChEMBL_665580 (CHEMBL1261464)
Ki
1500±n/a nM
Citation
 Skultety, MHübner, HLöber, SGmeiner, P Bioisosteric replacement leading to biologically active [2.2]paracyclophanes with altered binding profiles for aminergic G-protein-coupled receptors. J Med Chem 53:7219-28 (2010)  
Target
Name:
5-hydroxytryptamine receptor 2A
Synonyms:
5-HT-2 5-HT2 5HT2A_PIG Serotonin 2a (5-HT2a) receptor
Type:
Enzyme Catalytic Domain
Mol. Mass.:
52679.13
Organism:
PIG
Description:
5-HT2 0 0::P50129
Residue:
470
  
Inhibitor
Name:
BDBM50328457
Synonyms:
CHEMBL1258494 | N-[4-[4-(2-Methoxyphenyl)piperazin-1-yl]butyl]-2,5-dimethylbenzamide
Type:
Small organic molecule
Emp. Form.:
C24H33N3O2
Mol. Mass.:
395.5377
SMILES:
COc1ccccc1N1CCN(CCCCNC(=O)c2cc(C)ccc2C)CC1
: