Target
Alpha-1D adrenergic receptor
Ligand
BDBM50328494
Substrate
Meas. Tech.
ChEMBL_665658 (CHEMBL1261589)
Ki
25±n/a nM
Citation
 Kristensen, JLPüschl, AJensen, MRisgaard, RChristoffersen, CTBang-Andersen, BBalle, T Exploring the neuroleptic substituent in octoclothepin: potential ligands for positron emission tomography with subnanomolar affinity fora(1)-adrenoceptors. J Med Chem 53:7021-34 (2010)  
Target
Name:
Alpha-1D adrenergic receptor
Synonyms:
ADA1D_RAT Adra1d Alpha-1D adrenergic receptor | Serotonin 1a (5-HT1a) receptor/Adrenergic receptor alpha-1
Type:
Protein
Mol. Mass.:
59375.97
Organism:
Rattus norvegicus (Rat)
Description:
P23944
Residue:
561
  
Inhibitor
Name:
BDBM50328494
Synonyms:
1-(8-(2,5-Dimethylphenyl)-10,11-dihydrodibenzo[b,f]thiepin-10-yl)-4-methylpiperazine | CHEMBL1259097
Type:
Small organic molecule
Emp. Form.:
C27H30N2S
Mol. Mass.:
414.606
SMILES:
CN1CCN(CC1)C1Cc2ccccc2Sc2ccc(cc12)-c1c(C)cccc1C
: