Target
Renin
Ligand
BDBM50329026
Substrate
Meas. Tech.
ChEMBL_674153 (CHEMBL1274250)
IC50
752±n/a nM
Citation
 Scheiper, BMatter, HSteinhagen, HStilz, UBöcskei, ZFleury, VMcCort, G Discovery and optimization of a new class of potent and non-chiral indole-3-carboxamide-based renin inhibitors. Bioorg Med Chem Lett 20:6268-72 (2010)  
Target
Name:
Renin
Synonyms:
Angiotensinogenase RENI_HUMAN
Type:
Enzyme
Mol. Mass.:
45058.99
Organism:
Homo sapiens (Human)
Description:
Residue:
406
  
Inhibitor
Name:
BDBM50329026
Synonyms:
(2-(3-fluoro-2-methylbenzyl)-1-(tetrahydro-2H-pyran-4-yl)-1H-indol-3-yl)(piperazin-1-yl)methanone | CHEMBL1271285
Type:
Small organic molecule
Emp. Form.:
C26H30FN3O2
Mol. Mass.:
435.5337
SMILES:
Cc1c(F)cccc1Cc1c(C(=O)N2CCNCC2)c2ccccc2n1C1CCOCC1
: