Target
Renin
Ligand
BDBM50329032
Substrate
Meas. Tech.
ChEMBL_674153 (CHEMBL1274250)
IC50
6±n/a nM
Citation
 Scheiper, BMatter, HSteinhagen, HStilz, UBöcskei, ZFleury, VMcCort, G Discovery and optimization of a new class of potent and non-chiral indole-3-carboxamide-based renin inhibitors. Bioorg Med Chem Lett 20:6268-72 (2010)  
Target
Name:
Renin
Synonyms:
Angiotensinogenase RENI_HUMAN
Type:
Enzyme
Mol. Mass.:
45058.99
Organism:
Homo sapiens (Human)
Description:
Residue:
406
  
Inhibitor
Name:
BDBM50329032
Synonyms:
2-(5-fluoro-2-methylphenoxy)-1-phenyl-3-(piperazine-1-carbonyl)-1H-indole-5-carboxamide | CHEMBL1269963
Type:
Small organic molecule
Emp. Form.:
C27H25FN4O3
Mol. Mass.:
472.5108
SMILES:
Cc1ccc(F)cc1Oc1c(C(=O)N2CCNCC2)c2cc(ccc2n1-c1ccccc1)C(N)=O
: