Target
Renin
Ligand
BDBM50329037
Substrate
Meas. Tech.
ChEMBL_674153 (CHEMBL1274250)
IC50
680±n/a nM
Citation
 Scheiper, BMatter, HSteinhagen, HStilz, UBöcskei, ZFleury, VMcCort, G Discovery and optimization of a new class of potent and non-chiral indole-3-carboxamide-based renin inhibitors. Bioorg Med Chem Lett 20:6268-72 (2010)  
Target
Name:
Renin
Synonyms:
Angiotensinogenase RENI_HUMAN
Type:
Enzyme
Mol. Mass.:
45058.99
Organism:
Homo sapiens (Human)
Description:
Residue:
406
  
Inhibitor
Name:
BDBM50329037
Synonyms:
(2-(2-methoxyphenoxy)-1-phenyl-1H-indol-3-yl)(piperazin-1-yl)methanone | CHEMBL1270072
Type:
Small organic molecule
Emp. Form.:
C26H25N3O3
Mol. Mass.:
427.495
SMILES:
COc1ccccc1Oc1c(C(=O)N2CCNCC2)c2ccccc2n1-c1ccccc1
: