Target
Renin
Ligand
BDBM50329038
Substrate
Meas. Tech.
ChEMBL_674153 (CHEMBL1274250)
IC50
21±n/a nM
Citation
 Scheiper, BMatter, HSteinhagen, HStilz, UBöcskei, ZFleury, VMcCort, G Discovery and optimization of a new class of potent and non-chiral indole-3-carboxamide-based renin inhibitors. Bioorg Med Chem Lett 20:6268-72 (2010)  
Target
Name:
Renin
Synonyms:
Angiotensinogenase RENI_HUMAN
Type:
Enzyme
Mol. Mass.:
45058.99
Organism:
Homo sapiens (Human)
Description:
Residue:
406
  
Inhibitor
Name:
BDBM50329038
Synonyms:
(1-phenyl-2-(o-tolyloxy)-1H-indol-3-yl)(piperazin-1-yl)methanone | CHEMBL1270178
Type:
Small organic molecule
Emp. Form.:
C26H25N3O2
Mol. Mass.:
411.4956
SMILES:
Cc1ccccc1Oc1c(C(=O)N2CCNCC2)c2ccccc2n1-c1ccccc1
: