Target
Renin
Ligand
BDBM50329041
Substrate
Meas. Tech.
ChEMBL_674153 (CHEMBL1274250)
IC50
63±n/a nM
Citation
 Scheiper, BMatter, HSteinhagen, HStilz, UBöcskei, ZFleury, VMcCort, G Discovery and optimization of a new class of potent and non-chiral indole-3-carboxamide-based renin inhibitors. Bioorg Med Chem Lett 20:6268-72 (2010)  
Target
Name:
Renin
Synonyms:
Angiotensinogenase RENI_HUMAN
Type:
Enzyme
Mol. Mass.:
45058.99
Organism:
Homo sapiens (Human)
Description:
Residue:
406
  
Inhibitor
Name:
BDBM50329041
Synonyms:
(2-(3-fluorophenoxy)-1-phenyl-1H-indol-3-yl)(piperazin-1-yl)methanone | CHEMBL1270276
Type:
Small organic molecule
Emp. Form.:
C25H22FN3O2
Mol. Mass.:
415.4595
SMILES:
Fc1cccc(Oc2c(C(=O)N3CCNCC3)c3ccccc3n2-c2ccccc2)c1
: