Target
Renin
Ligand
BDBM50329044
Substrate
Meas. Tech.
ChEMBL_674153 (CHEMBL1274250)
IC50
16±n/a nM
Citation
 Scheiper, BMatter, HSteinhagen, HStilz, UBöcskei, ZFleury, VMcCort, G Discovery and optimization of a new class of potent and non-chiral indole-3-carboxamide-based renin inhibitors. Bioorg Med Chem Lett 20:6268-72 (2010)  
Target
Name:
Renin
Synonyms:
Angiotensinogenase RENI_HUMAN
Type:
Enzyme
Mol. Mass.:
45058.99
Organism:
Homo sapiens (Human)
Description:
Residue:
406
  
Inhibitor
Name:
BDBM50329044
Synonyms:
(2-(2-fluoro-6-methylphenoxy)-1-phenyl-1H-indol-3-yl)(piperazin-1-yl)methanone | CHEMBL1270468
Type:
Small organic molecule
Emp. Form.:
C26H24FN3O2
Mol. Mass.:
429.4861
SMILES:
Cc1cccc(F)c1Oc1c(C(=O)N2CCNCC2)c2ccccc2n1-c1ccccc1
: