Target
Renin
Ligand
BDBM50329049
Substrate
Meas. Tech.
ChEMBL_674153 (CHEMBL1274250)
IC50
6460±n/a nM
Citation
 Scheiper, BMatter, HSteinhagen, HStilz, UBöcskei, ZFleury, VMcCort, G Discovery and optimization of a new class of potent and non-chiral indole-3-carboxamide-based renin inhibitors. Bioorg Med Chem Lett 20:6268-72 (2010)  
Target
Name:
Renin
Synonyms:
Angiotensinogenase RENI_HUMAN
Type:
Enzyme
Mol. Mass.:
45058.99
Organism:
Homo sapiens (Human)
Description:
Residue:
406
  
Inhibitor
Name:
BDBM50329049
Synonyms:
CHEMBL1270669 | rac-(3-methylpiperazin-1-yl)(2-phenoxy-1-phenyl-1H-indol-3-yl)methanone
Type:
Small organic molecule
Emp. Form.:
C26H25N3O2
Mol. Mass.:
411.4956
SMILES:
CC1CN(CCN1)C(=O)c1c(Oc2ccccc2)n(-c2ccccc2)c2ccccc12
: