Target
Renin
Ligand
BDBM50329050
Substrate
Meas. Tech.
ChEMBL_674153 (CHEMBL1274250)
IC50
7300±n/a nM
Citation
 Scheiper, BMatter, HSteinhagen, HStilz, UBöcskei, ZFleury, VMcCort, G Discovery and optimization of a new class of potent and non-chiral indole-3-carboxamide-based renin inhibitors. Bioorg Med Chem Lett 20:6268-72 (2010)  
Target
Name:
Renin
Synonyms:
Angiotensinogenase RENI_HUMAN
Type:
Enzyme
Mol. Mass.:
45058.99
Organism:
Homo sapiens (Human)
Description:
Residue:
406
  
Inhibitor
Name:
BDBM50329050
Synonyms:
(3,3-dimethylpiperazin-1-yl)(2-phenoxy-1-phenyl-1H-indol-3-yl)methanone | CHEMBL1270770
Type:
Small organic molecule
Emp. Form.:
C27H27N3O2
Mol. Mass.:
425.5222
SMILES:
CC1(C)CN(CCN1)C(=O)c1c(Oc2ccccc2)n(-c2ccccc2)c2ccccc12
: