Target
Calcitonin gene-related peptide type 1 receptor
Ligand
BDBM50301954
Substrate
Meas. Tech.
ChEMBL_674428 (CHEMBL1274757)
Ki
1.9±n/a nM
Citation
 Wood, MRSchirripa, KMKim, JJBednar, RAFay, JFBruno, JGMoore, ELMosser, SDRoller, SSalvatore, CAVacca, JPSelnick, HG Novel CGRP receptor antagonists from central amide replacements causing a reversal of preferred chirality. Bioorg Med Chem Lett 20:6827-30 (2010)  
Target
Name:
Calcitonin gene-related peptide type 1 receptor
Synonyms:
Adrenomedullin receptor AM1; CALCRL/RAMP2 CALRL_HUMAN CGRP type 1 receptor mRNA Calcitonin gene-related peptide (CGRP) receptor Calcitonin receptor-like receptor Human CL receptor
Type:
Enzyme Catalytic Domain
Mol. Mass.:
52980.45
Organism:
Homo sapiens (Human)
Description:
Q16602
Residue:
461
  
Inhibitor
Name:
BDBM50301954
Synonyms:
(S)-N-benzyl-N-(2-(3-methyl-2,5-dioxo-1',3'-dihydrospiro[imidazolidine-4,2'-indene]-5'-ylamino)-2-oxoethyl)pivalamide | CHEMBL571823
Type:
Small organic molecule
Emp. Form.:
C26H30N4O4
Mol. Mass.:
462.5408
SMILES:
CN1C(=O)NC(=O)[C@@]11Cc2ccc(NC(=O)CN(Cc3ccccc3)C(=O)C(C)(C)C)cc2C1
: