Target
Calcitonin gene-related peptide type 1 receptor
Ligand
BDBM50329168
Substrate
Meas. Tech.
ChEMBL_674428 (CHEMBL1274757)
Ki
35±n/a nM
Citation
 Wood, MRSchirripa, KMKim, JJBednar, RAFay, JFBruno, JGMoore, ELMosser, SDRoller, SSalvatore, CAVacca, JPSelnick, HG Novel CGRP receptor antagonists from central amide replacements causing a reversal of preferred chirality. Bioorg Med Chem Lett 20:6827-30 (2010)  
Target
Name:
Calcitonin gene-related peptide type 1 receptor
Synonyms:
Adrenomedullin receptor AM1; CALCRL/RAMP2 CALRL_HUMAN CGRP type 1 receptor mRNA Calcitonin gene-related peptide (CGRP) receptor Calcitonin receptor-like receptor Human CL receptor
Type:
Enzyme Catalytic Domain
Mol. Mass.:
52980.45
Organism:
Homo sapiens (Human)
Description:
Q16602
Residue:
461
  
Inhibitor
Name:
BDBM50329168
Synonyms:
CHEMBL1269978 | N-benzyl-N-((3'-methyl-2',5'-dioxo-6,8-dihydrospiro[cyclopenta[g]quinoline-7,4'-imidazolidine]-3-yl)methyl)pivalamide
Type:
Small organic molecule
Emp. Form.:
C28H30N4O3
Mol. Mass.:
470.5628
SMILES:
CN1C(=O)NC(=O)C11Cc2cc3cc(CN(Cc4ccccc4)C(=O)C(C)(C)C)cnc3cc2C1
: